{"text_format":"1","workbook":"xlsx","n_sheets":28,"sheets":["I.","II.","III.1.","III.2.","III.3.","III.4.","IV.","V.1.","V.1a.","V.2.","V.2a.","V.3.","VI.1.","VI.2.","VI.3.","VI.4.","VI.5.","VII.1.","VII.2.","VIII.1.","IX.1.","IX.2.","X.1.","X.2.","XI.","XII.","obl","zav"],"not_rendered":{"charts":0,"images":0,"macros":1,"external_links":0,"defined_names":1,"comments":0,"pivot_tables":0},"unopened":[],"bounds":{"document_bytes":16777216,"sheet_cells":100000,"rows_first":2000,"rows_last":500,"rows_between":2000,"halvings":0,"cell_chars":16384,"cell_head_chars":4096},"cells_cut":0,"cells_raw":0,"read":"whole","date_system":"1900"}

{"sheet":"I.","index":0,"n_rows":12,"n_cols":12,"rows_kept":12,"cut":false,"hidden":false,"merged":[[2,11,6,14],[1,2,1,4],[5,1,5,3],[0,11,0,14],[1,11,1,14]]}
[{"$f":"IF(ISNA(VLOOKUP(C1,obl!A1:B28,2,FALSE))=TRUE,\"\",(VLOOKUP(C1,obl!A1:B28,2,FALSE)))","v":""},"Област:",null,null,null,null,{"$f":"IF(MID(C1,1,2)=MID(C2,1,2),\"\",\"Избери заведение с код от същата област \")","v":""},null,null,null,null,"Формуляр \"З\" - 365-О"]
[{"$f":"IF(ISNA(VLOOKUP(C2,zav!B1:C448,2,FALSE))=TRUE,\"\",(VLOOKUP(C2,zav!B1:C448,2,FALSE)))","v":""},"Лечебно заведение:",null,null,null,null,{"$f":"IF(MID(C2,1,2)=A1,\"\",\"Избраното болнично заведение е от друга област\")","v":""},null,null,null,null,"годишен"]
[null,"Година:",2023,null,null,null,null,null,null,null,null,"Представя се на РЗИ от лечебните заведения за извънболнична помощ:\n1. Амбулатории за първична медицинска помощ\n2. Амбулатории за специализирана медицинска помощ\n3. Самостоятелни медико-диагностични и медико-технически лаборатории\n4. Амбулатории за здравни грижи\n"]
[]
[]
[null,"ОТЧЕТ НА ЛЕЧЕБНИТЕ ЗАВЕДЕНИЯ ЗА ИЗВЪНБОЛНИЧНА ПОМОЩ"]
[]
[null,"Раздел І."]
[1,"Регистрирани и отчетени заведения"]
[null,null,null,null,null,"ХОРИЗОНТАЛЕН КОНТРОЛ:"]
[null,"Регистрирани заведения (брой)","Отчетени заведения (брой)","Отн. дял",null,"к.1і к.2 "]
[null,null,null,{"$f":"C12*100/B12","v":{"$error":"#DIV/0!"}},null,{"$f":"IF(B12<C12,\"грешка\",\"\")","v":""}]

{"sheet":"II.","index":1,"n_rows":138,"n_cols":34,"rows_kept":138,"cut":false,"hidden":false,"merged":[[10,1,14,1],[10,2,14,2],[11,3,14,3],[13,12,13,14],[13,15,13,17],[12,4,14,4],[12,5,14,5],[13,6,13,8],[13,9,13,11],[13,21,13,23],[10,3,10,23],[11,4,11,23],[12,6,12,23],[11,33,12,33],[11,30,12,30],[11,31,12,31],[11,32,12,32],[11,25,12,25],[11,26,12,26],[11,27,14,27],[11,28,12,28],[11,29,12,29],[13,18,13,20]]}
[{"$f":"I.!A1","v":""},"Област:",{"$f":"I.!C1","v":0}]
[{"$f":"I.!A2","v":""},"Лечебно заведение:",{"$f":"I.!C2","v":0}]
[null,"Година:",{"$f":"I.!C3","v":2023}]
[]
[]
[]
[]
[null,"Раздел ІІ."]
[2,"Персонал в края на годината"]
[null,null,null,null,null,null,null,null,null,null,null,null,null,null,null,null,null,null,null,null,null,null,null,null,null,"ХОРИЗОНТАЛЕН КОНТРОЛ:"]
[null,null,"Шиф-ър","Физически лица"]
[null,null,null,"Общо","от тях: на основен трудов договор",null,null,null,null,null,null,null,null,null,null,null,null,null,null,null,null,null,null,null,null,"к.1і к.2 ","к.2і к.3 ","к.2= к.4 +к.7+ к.10+ к.13+ к.16+к.19","к.4= к.5 +к.6","к.7= к.8 +к.9","к.10= к.11 +к.12","к.13= к.14 +к.15","к.16= к.17 +к.18","к.19= к.20 +к.21"]
[null,null,null,null,"Всич-ко","с придо-бита специ-алност","Персонал(физически лица) на основен трудов договор по възрастови групи и пол"]
[null,null,null,null,null,null,"под 35 години",null,null,"35 - 44 години",null,null,"45 - 54 години",null,null,"55 - 64 години",null,null,"65-74  години",null,null,"75+  години"]
[null,null,null,null,null,null,"общо","мъже","жени","общо","мъже","жени","общо","мъже","жени","общо","мъже","жени","общо","мъже","жени","общо","мъже","жени"]
{"$rows_left_out":124}
{"sheet":"III.1.","index":2,"n_rows":67,"n_cols":14,"rows_kept":67,"cut":false,"hidden":false,"merged":[[10,8,12,8],[10,1,12,1],[10,2,12,2],[10,7,12,7],[11,3,12,3],[11,4,11,6],[10,3,10,6]]}
[{"$f":"I.!A1","v":""},"Област:",{"$f":"I.!C1","v":0}]
[{"$f":"I.!A2","v":""},"Лечебно заведение:",{"$f":"I.!C2","v":0}]
[null,"Година:",{"$f":"I.!C3","v":2023}]
[]
[]
[]
[]
[null,"Раздел ІII. Консултативно-амбулаторна дейност"]
[3,"1. Посещения"]
[null,null,null,null,null,null,null,null,null,null,"ХОРИЗОНТАЛЕН КОНТРОЛ:"]
[null,null,"Ши-фър","Посещения в амбулаторията",null,null,null,"Посещения по домовете","Лекарски телекон-султации"]
[null,null,null,"Всичко","в това число"]
[null,null,null,null,"деца до 17 г.","профилак-тични         (от к.1)","от тях на деца до 17 г.            (от к.3)",null,null,null,"к.1і к.2 ","к.1і к.3 ","к.3і к.4 ","к.2і к.4 "]
[null,"а","б",1,2,3,4,5,6]
[null,"Лекари (ш.02+03+35)","01",null,null,null,null,null,null,null,{"$f":"IF(D15<E15,\"грешка\",\"\")","v":""},{"$f":"IF(D15<F15,\"грешка\",\"\")","v":""},{"$f":"IF(F15<G15,\"грешка\",\"\")","v":""},{"$f":"IF(E15<G15,\"грешка\",\"\")","v":""}]
{"$rows_left_out":53}
{"sheet":"III.2.","index":3,"n_rows":18,"n_cols":5,"rows_kept":18,"cut":false,"hidden":false,"merged":[[10,1,11,1],[10,2,11,2],[10,3,10,4]]}
[{"$f":"I.!A1","v":""},"Област:",{"$f":"I.!C1","v":0}]
[{"$f":"I.!A2","v":""},"Лечебно заведение:",{"$f":"I.!C2","v":0}]
[null,"Година:",{"$f":"I.!C3","v":2023}]
[]
[]
[]
[]
[null,"Раздел ІII. Консултативно-амбулаторна дейност"]
[4,"2. Профилактична дейност (не се попълва от лекари по дентална медицина)"]
[]
[null,"Профилактични прегледи","Ши-фър","Възраст в навършени години"]
[null,null,null," 0 - 17 год.","над 18 год."]
[null,"а","б",1,2]
[null,"Обхванати с профилактичен преглед","01"]
[null,"Открити заболявания","02"]
{"$rows_left_out":4}
{"sheet":"III.3.","index":4,"n_rows":18,"n_cols":4,"rows_kept":18,"cut":false,"hidden":false,"merged":[]}
[{"$f":"I.!A1","v":""},"Област:",{"$f":"I.!C1","v":0}]
[{"$f":"I.!A2","v":""},"Лечебно заведение:",{"$f":"I.!C2","v":0}]
[null,"Година:",{"$f":"I.!C3","v":2023}]
[]
[]
[]
[]
[null,"Раздел ІII. Консултативно-амбулаторна дейност"]
[5,"3. Процедури (не се попълва от лекари по дентална медицина)"]
[]
[null,"Профилактични прегледи","Ши-фър","Брой"]
[null,null,"б",1]
[null,"Извършени хирургични процедури - всичко","01"]
[null,"от тях: амбулаторни","02"]
[null,"Екстракорпорална литотрипсия с ударни вълни","03"]
{"$rows_left_out":4}
{"sheet":"III.4.","index":5,"n_rows":52,"n_cols":15,"rows_kept":52,"cut":false,"hidden":false,"merged":[[10,14,12,14],[10,1,12,1],[10,2,12,2],[10,3,12,3],[10,4,12,4],[10,12,12,12],[11,6,11,8],[10,10,12,10],[10,9,12,9],[10,13,12,13],[10,5,10,8],[11,5,12,5]]}
[{"$f":"I.!A1","v":""},"Област:",{"$f":"I.!C1","v":0}]
[{"$f":"I.!A2","v":""},"Лечебно заведение:",{"$f":"I.!C2","v":0}]
[null,"Година:",{"$f":"I.!C3","v":2023}]
[]
[]
[]
[]
[null,"Раздел ІII. Консултативно-амбулаторна дейност"]
[6,"4. Диспансерно наблюдение",null,null,null,null,null,null,null,null,null,null,"ХОРИЗОНТАЛЕН КОНТРОЛ:"]
[]
[null,"Наименование на болестите ","Шифър","Под наблюдение в началото на годината","Взети под наблюде- ние през годината","Снети от наблюдение ",null,null,null,"Остават под наблюде- ние в края на годината","В т.ч. деца до 17 г.",null,"к.3=к.4+к.5+к.6","к.7=к.1+к.2-к.3","к.7і к.8 "]
[null,null,null,null,null,"всичко","по причини"]
[null,null,null,null,null,null,"оздравя-ване","умиране","промяна в местож., работа и др.причини"]
[null,"а","б",1,2,3,4,5,6,7,8]
[null,"Общо (ш.02+03+05+08+10+11+15+20+22+23+27+28)","01",null,null,null,null,null,null,null,null,null,{"$f":"IF(F15=G15+H15+I15,\"\",\"грешка\")","v":""},{"$f":"IF(J15=D15+E15-F15,\"\",\"грешка\")","v":""},{"$f":"IF(J15<K15,\"грешка\",\"\")","v":""}]
{"$rows_left_out":38}
{"sheet":"IV.","index":6,"n_rows":15,"n_cols":21,"rows_kept":15,"cut":false,"hidden":false,"merged":[[11,9,12,9],[11,1,12,1],[11,2,12,2],[11,3,11,4],[11,5,12,5],[11,6,11,8],[11,17,12,17],[11,18,12,18],[11,19,12,19],[11,20,12,20],[11,10,12,10],[11,11,12,11],[11,12,12,12],[11,13,12,13],[11,14,12,14],[11,15,12,15]]}
[{"$f":"I.!A1","v":""},"Област:",{"$f":"I.!C1","v":0}]
[{"$f":"I.!A2","v":""},"Лечебно заведение:",{"$f":"I.!C2","v":0}]
[null,"Година:",{"$f":"I.!C3","v":2023}]
[]
[]
[]
[]
[null,"Раздел ІV. "]
[7,"Легла за наблюдение и лечение до 48 часа"]
[]
[null,null,null,null,null,null,null,null,null,null,null,null,null,null,null,null,null,"ХОРИЗОНТАЛЕН КОНТРОЛ:"]
[null,null,"Ши-фър","Легла",null,"Болни в началото на годината","През годината",null,null,"Болни в края на годината","Прове-дени леглодни през годината","Изпол-зваемост","Среден престой","Оборот","Летали-тет","Преми-нали болни",null,"к.7=(к.3+к.4)-(к.5+к.6)","ако в колони от 3 до 7 има данни, то и в к.2 трябва да има данни","ако в колони от 3 до 7 има данни, то и в к.8 трябва да има данни","ако в колона 8 има данни, то и в к.2 и в някоя от колони 3 до 7 трябва да има данни"]
[null,null,null,"в края на годината","средно-годишен брой легла",null,"постъпили","изписани","умрели"]
[null,"а","б",1,2,3,4,5,6,7,8,9,10,11,12,13]
[null,"Общо","01",null,null,null,null,null,null,null,null,{"$f":"K15/E15","v":{"$error":"#DIV/0!"}},{"$f":"K15/(F15+G15)","v":{"$error":"#DIV/0!"}},{"$f":"(F15+G15)/E15","v":{"$error":"#DIV/0!"}},{"$f":"I15*100/(H15+I15)","v":{"$error":"#DIV/0!"}},{"$f":"F15+G15","v":0},null,{"$f":"IF(J15=(F15+G15)-(H15+I15),\"\",\"грешка\")","v":""},{"$f":"IF(SUM(F15:J15)>0,IF(E15>0,\"\",\"грешка\"),\"\")","v":""},{"$f":"IF(SUM(F15:J15)>0,IF(K15>0,\"\",\"грешка\"),\"\")","v":""},{"$f":"IF(K15>0,IF(E15>0,IF(SUM(F15:J15)>0,\"\",\"грешка\"),\"грешка\"),\"\")","v":""}]
{"$rows_left_out":1}
{"sheet":"V.1.","index":7,"n_rows":46,"n_cols":4,"rows_kept":46,"cut":false,"hidden":false,"merged":[]}
[{"$f":"I.!A1","v":""},"Област:",{"$f":"I.!C1","v":0}]
[{"$f":"I.!A2","v":""},"Лечебно заведение:",{"$f":"I.!C2","v":0}]
[null,"Година:",{"$f":"I.!C3","v":2023}]
[]
[]
[]
[]
[null,"Раздел V. Акушеро-гинекологична дейност"]
[8,"1. Аборти, извършени в заведението"]
[]
[null,null,"Ши-фър","Общо"]
[null,"а","б",1]
[null,"Аборти (О03-О06) - всичко (ш.02+06+17)","01"]
[null,"Спонтанни аборти (О03) (ш.03 до 05)","02"]
[null,"Бременни до:  12 гестационна седмица","03"]
{"$rows_left_out":32}
{"sheet":"V.1a.","index":8,"n_rows":35,"n_cols":12,"rows_kept":35,"cut":false,"hidden":false,"merged":[[10,11,11,11],[11,4,12,4],[11,5,12,5],[11,6,11,7],[11,8,12,8],[10,1,12,1],[10,2,12,2],[10,3,12,3],[10,4,10,8],[10,10,11,10]]}
[{"$f":"I.!A1","v":""},"Област:",{"$f":"I.!C1","v":0}]
[{"$f":"I.!A2","v":""},"Лечебно заведение:",{"$f":"I.!C2","v":0}]
[null,"Година:",{"$f":"I.!C3","v":2023}]
[]
[]
[]
[]
[null,"Раздел V. Акушеро-гинекологична дейност"]
[9,"1а. Аборти по възраст на жената"]
[null,null,null,null,null,null,null,null,null,null,"ХОРИЗОНТАЛЕН КОНТРОЛ:"]
[null,"Възраст (в навършени години)","Ши-фър","Аборти (О03-О06) (к.2+3+6)","По вид",null,null,null,null,null,"к.1= к.2+к.3+к.6","к.3 = к.4+к.5"]
[null,null,null,null,"Спонт-анни (О03)","Терапев-тични (О04)","от тях:",null,"други видове и аборт, неуточнен (О05,О06)"]
[null,null,null,null,null,null,"по желание ","по медицин-ски показа- ния"]
[null,"а","б",1,2,3,4,5,6]
[null,"Общо ","01",null,null,null,null,null,null,null,{"$f":"IF(D15=E15+F15+I15,\"\",\"грешка\")","v":""},{"$f":"IF(F15=G15+H15,\"\",\"грешка\")","v":""}]
{"$rows_left_out":21}
{"sheet":"V.2.","index":9,"n_rows":21,"n_cols":4,"rows_kept":21,"cut":false,"hidden":false,"merged":[]}
[{"$f":"I.!A1","v":""},"Област:",{"$f":"I.!C1","v":0}]
[{"$f":"I.!A2","v":""},"Лечебно заведение:",{"$f":"I.!C2","v":0}]
[null,"Година:",{"$f":"I.!C3","v":2023}]
[]
[]
[]
[]
[null,"Раздел V. Акушеро-гинекологична дейност"]
[10,"2. Профилактична АГ дейност"]
[]
[null,null,"Ши-фър","Брой"]
[null,"а","б",1]
[null,"Прегледани жени - всичко","01"]
[null,"в т.ч. с цитонамазка","02"]
[null,"Открити за първи път:                           гинекологични заболявания","03"]
{"$rows_left_out":7}
{"sheet":"V.2a.","index":10,"n_rows":14,"n_cols":16,"rows_kept":14,"cut":false,"hidden":false,"merged":[[10,1,11,1],[10,2,11,2],[10,3,11,3],[10,4,10,10],[10,15,11,15]]}
[{"$f":"I.!A1","v":""},"Област:",{"$f":"I.!C1","v":0}]
[{"$f":"I.!A2","v":""},"Лечебно заведение:",{"$f":"I.!C2","v":0}]
[null,"Година:",{"$f":"I.!C3","v":2023}]
[]
[]
[]
[]
[null,"Раздел V. Акушеро-гинекологична дейност"]
[11,"2а. Профилактична дейност на бременни"]
[null,null,null,null,null,null,null,null,null,null,null,null,"ХОРИЗОНТАЛЕН КОНТРОЛ:"]
[null,null,"Ши-фър","Общо","в това число за:",null,null,null,null,null,null,null,"к.3і к.4","к.5і к.6","к.7і к.8","ако има данни в колони от 2, 3, 5 и 7, то и в к.1 трябва да има данни"]
[null,null,null,null,"Пренатален скрининг","Сифилис","от тях: положи-телни проби","ХИВ","от тях: положителни проби","Хепатит В","от тях: положи-телни проби"]
[null,"а","б",1,2,3,4,5,6,7,8]
[null,"Изследвани бременни - всичко","01",null,null,null,null,null,null,null,null,null,{"$f":"IF(F14>=G14,\"\",\"грешка\")","v":""},{"$f":"IF(H14>=I14,\"\",\"грешка\")","v":""},{"$f":"IF(J14>=K14,\"\",\"грешка\")","v":""},{"$f":"IF((SUM(E14:H14)+J14)>0,IF(D14>0,\"\",\"грешка\"),\"\")","v":""}]

{"sheet":"V.3.","index":11,"n_rows":34,"n_cols":4,"rows_kept":34,"cut":false,"hidden":false,"merged":[]}
[{"$f":"I.!A1","v":""},"Област:",{"$f":"I.!C1","v":0}]
[{"$f":"I.!A2","v":""},"Лечебно заведение:",{"$f":"I.!C2","v":0}]
[null,"Година:",{"$f":"I.!C3","v":2023}]
[]
[]
[]
[]
[null,"Раздел V. Акушеро-гинекологична дейност"]
[12,"3. Асистирана репродукция"]
[]
[null,null,"Ши-фър","Брой"]
[null,"а","б",1]
[null,"Легла","01"]
[null,"Лекари","02"]
[null,"в т.ч.: акушеро-гинеколози","03"]
{"$rows_left_out":20}
{"sheet":"VI.1.","index":12,"n_rows":24,"n_cols":4,"rows_kept":24,"cut":false,"hidden":false,"merged":[]}
[{"$f":"I.!A1","v":""},"Област:",{"$f":"I.!C1","v":0}]
[{"$f":"I.!A2","v":""},"Лечебно заведение:",{"$f":"I.!C2","v":0}]
[null,"Година:",{"$f":"I.!C3","v":2023}]
[]
[]
[]
[]
[null,"Раздел VІ. Дейност на психиатричните структури"]
[13,"1. Структурни звена"]
[]
[null,null,"Шиф-ър","Брой"]
[null,"а","б",1]
[null,"Психиатрия","01"]
[null,"Детско-юношеска психиатрия","02"]
[null,"Наркология","03"]
{"$rows_left_out":10}
{"sheet":"VI.2.","index":13,"n_rows":51,"n_cols":22,"rows_kept":51,"cut":false,"hidden":false,"merged":[[10,21,11,21],[11,9,11,10],[10,1,12,1],[10,2,12,2],[10,3,12,3],[10,4,12,4],[10,5,10,6],[10,7,12,7],[11,5,12,5],[11,6,12,6],[10,8,12,8],[10,9,10,10],[10,11,12,11],[10,12,12,12],[10,13,12,13]]}
[{"$f":"I.!A1","v":""},"Област:",{"$f":"I.!C1","v":0}]
[{"$f":"I.!A2","v":""},"Лечебно заведение:",{"$f":"I.!C2","v":0}]
[null,"Година:",{"$f":"I.!C3","v":2023}]
[]
[]
[]
[]
[null,"Раздел VІ. Дейност на психиатричните структури"]
[14,"2. Болни под наблюдение"]
[null,null,null,null,null,null,null,null,null,null,null,null,null,null,null,"ХОРИЗОНТАЛЕН КОНТРОЛ:"]
[null,"Наименование на болестите по МКБ-10","Шифър","Под наблюдение в началото на годината","Взети под наблюде- ние през годината","В това число",null,"Болни приведени в дадената група поради промяна на диагнозата","Снети от наблю-дение през годината","В това число:",null,"Болни преведени в други групи поради промяна на диагнозата","Остават под наблюде- ние в края на годината","В това число особено обществено опасни",null,"к.5= к.9, за ш.01 ","к.2і к.3 ","к.2і к.4 ","к.6і к.7 ","к.7і к.8 ","к.10і к.11","к.10=(к.1+к.2+к.5)-(к.6+к.9)"]
[null,null,null,null,null,"деца от 0 до 17 г.","заболели за първи път в живота си (от к.2)",null,null,"умрели"]
[null,null,null,null,null,null,null,null,null,"всичко","от тях: самоу-били се"]
[null,"а","б",1,2,3,4,5,6,7,8,9,10,11]
[null,"Всичко (ш.02+27)","01",null,null,null,null,null,null,null,null,null,null,null,null,{"$f":"IF(H15<>L15,\"грешка\",\"\")","v":""},{"$f":"IF(E15<F15,\"грешка\",\"\")","v":""},{"$f":"IF(E15<G15,\"грешка\",\"\")","v":""},{"$f":"IF(I15<J15,\"грешка\",\"\")","v":""},{"$f":"IF(J15<K15,\"грешка\",\"\")","v":""},{"$f":"IF(M15<N15,\"грешка\",\"\")","v":""},{"$f":"IF(M15=(D15+E15+H15)-(I15+L15),\"\",\"грешка\")","v":""}]
{"$rows_left_out":37}
{"sheet":"VI.3.","index":14,"n_rows":14,"n_cols":9,"rows_kept":14,"cut":false,"hidden":false,"merged":[]}
[{"$f":"I.!A1","v":""},"Област:",{"$f":"I.!C1","v":0}]
[{"$f":"I.!A2","v":""},"Лечебно заведение:",{"$f":"I.!C2","v":0}]
[null,"Година:",{"$f":"I.!C3","v":2023}]
[]
[]
[]
[]
[null,"Раздел VІ. Дейност на психиатричните структури"]
[15,"3. Произшествия"]
[]
[null,null,"Ши-фър","Болни, извършили убийства","Болни, направили опит за самоубийство","Болни, извършили бягство","Нападения, извършени от болни срещу персонала","Нападения, извършени от болни срещу болни","Агресия срещу инвентар"]
[null,"а","б",1,2,3,4,5,6]
[null,"В стационара ","01"]
[null,"В извънболнични условия","02"]

{"sheet":"VI.4.","index":15,"n_rows":14,"n_cols":15,"rows_kept":14,"cut":false,"hidden":false,"merged":[[10,8,10,9],[10,1,11,1],[10,2,11,2],[10,3,11,3],[10,4,10,5],[10,6,10,7]]}
[{"$f":"I.!A1","v":""},"Област:",{"$f":"I.!C1","v":0}]
[{"$f":"I.!A2","v":""},"Лечебно заведение:",{"$f":"I.!C2","v":0}]
[null,"Година:",{"$f":"I.!C3","v":2023}]
[]
[]
[]
[]
[null,"Раздел VІ. Дейност на психиатричните структури"]
[16,"4. Съдебно-психиатрична експертиза"]
[null,null,null,null,null,null,null,null,null,null,null,"ХОРИЗОНТАЛЕН КОНТРОЛ:"]
[null,null,"Ши-фър","Общо (к.2+4+6)","В наказателен процес",null,"В граждански процес",null,"По член 156 от Закон за здравето",null,null,"к.1= к.2+к.4+к.6","к.2і к.3 ","к.4і к.5 ","к.6і к.7 "]
[null,null,null,null,"всичко","в т.ч. невменяеми","всичко","в т.ч. недееспо-собни","всичко","в т.ч. за прекратяване"]
[null,"а","б",1,2,3,4,5,6,7]
[null,"Експертизи","01",null,null,null,null,null,null,null,null,{"$f":"IF(D14<>E14+G14+I14,\"грешка\",\"\")","v":""},{"$f":"IF(E14<F14,\"грешка\",\"\")","v":""},{"$f":"IF(G14<H14,\"грешка\",\"\")","v":""},{"$f":"IF(I14<J14,\"грешка\",\"\")","v":""}]

{"sheet":"VI.5.","index":16,"n_rows":18,"n_cols":5,"rows_kept":18,"cut":false,"hidden":false,"merged":[]}
[{"$f":"I.!A1","v":""},"Област:",{"$f":"I.!C1","v":0}]
[{"$f":"I.!A2","v":""},"Лечебно заведение:",{"$f":"I.!C2","v":0}]
[null,"Година:",{"$f":"I.!C3","v":2023}]
[]
[]
[]
[]
[null,"Раздел VІ. Дейност на психиатричните структури"]
[17,"5. Болни, включени в рехабилитация"]
[]
[null,"Вид рехабилитация","Ши-фър","Болнична рехабили-тация","Извънболнична рехабилитация"]
[null,"а","б",1,2]
[null,"Трудотерапия","01"]
[null,"Занимателна терапия","02"]
[null,"Кинезитерапия","03"]
{"$rows_left_out":4}
{"sheet":"VII.1.","index":17,"n_rows":25,"n_cols":4,"rows_kept":25,"cut":false,"hidden":false,"merged":[]}
[{"$f":"I.!A1","v":""},"Област:",{"$f":"I.!C1","v":0}]
[{"$f":"I.!A2","v":""},"Лечебно заведение:",{"$f":"I.!C2","v":0}]
[null,"Година:",{"$f":"I.!C3","v":2023}]
[]
[]
[]
[]
[null,"Раздел VІІ. Дейност на кожно-венерологичните структури"]
[18,"1. Структурни звена"]
[]
[null,null,"Шиф-ър","Брой"]
[null,"а","б",1]
[null,"Кожни и венерически болести","01"]
[null,"Дерматология","02"]
[null,"от тях: Дерматоалергология","03"]
{"$rows_left_out":11}
{"sheet":"VII.2.","index":18,"n_rows":25,"n_cols":11,"rows_kept":25,"cut":false,"hidden":false,"merged":[[10,1,11,1],[10,2,11,2],[10,3,11,3],[10,4,10,8],[10,10,11,10]]}
[{"$f":"I.!A1","v":""},"Област:",{"$f":"I.!C1","v":0}]
[{"$f":"I.!A2","v":""},"Лечебно заведение:",{"$f":"I.!C2","v":0}]
[null,"Година:",{"$f":"I.!C3","v":2023}]
[]
[]
[]
[]
[null,"Раздел VІІ. Дейност на кожно-венерологичните структури"]
[19,"2. Профилактична дейност"]
[null,null,null,null,null,null,null,null,null,null,"ХОРИЗОНТАЛЕН КОНТРОЛ:"]
[null,null,"Ши-фър","Прегледа-ни лица","Открити заболявания",null,null,null,null,null,"ако в колони от 2 до 6  има данни, то и в к.1 трябва да има данни"]
[null,null,null,null,"сифилис","гоно-рея","краста","микотични заболя-вания","други"]
[null,"а","б",1,2,3,4,5,6]
[null,"Всичко (ш.02 до 06)","01",null,null,null,null,null,null,null,{"$f":"IF(SUM(E14:I14)>0,IF(D14=0,\"грешка\",\"\"),\"\")","v":""}]
[null,"Работещи в детски заведения","02",null,null,null,null,null,null,null,{"$f":"IF(SUM(E15:I15)>0,IF(D15=0,\"грешка\",\"\"),\"\")","v":""}]
{"$rows_left_out":11}
{"sheet":"VIII.1.","index":19,"n_rows":28,"n_cols":4,"rows_kept":28,"cut":false,"hidden":false,"merged":[]}
[{"$f":"I.!A1","v":""},"Област:",{"$f":"I.!C1","v":0}]
[{"$f":"I.!A2","v":""},"Лечебно заведение:",{"$f":"I.!C2","v":0}]
[null,"Година:",{"$f":"I.!C3","v":2023}]
[]
[]
[]
[]
[null,"Раздел VІIІ. Дейност на онкологичните структури"]
[20,"1. Структурни звена"]
[]
[null,null,"Шиф-ър","Брой"]
[null,"а","б",1]
[null,"Вътрешни болести","01"]
[null,"Гинекология","02"]
[null,"Клинична хематология","03"]
{"$rows_left_out":14}
{"sheet":"IX.1.","index":20,"n_rows":19,"n_cols":4,"rows_kept":19,"cut":false,"hidden":false,"merged":[]}
[{"$f":"I.!A1","v":""},"Област:",{"$f":"I.!C1","v":0}]
[{"$f":"I.!A2","v":""},"Лечебно заведение:",{"$f":"I.!C2","v":0}]
[null,"Година:",{"$f":"I.!C3","v":2023}]
[]
[]
[]
[]
[null,"Раздел IX. Дейност на пневмофтизиатричните структури"]
[21,"1. Структурни звена"]
[]
[null,null,"Шиф-ър","Брой"]
[null,"а","б",1]
[null,"Пневмология и фтизиатрия","01"]
[null,"Хронични неспецифични белодробни заболявания","02"]
[null,"Функционална диагностика","03"]
{"$rows_left_out":5}
{"sheet":"IX.2.","index":21,"n_rows":22,"n_cols":8,"rows_kept":22,"cut":false,"hidden":false,"merged":[[10,1,11,1],[10,2,11,2],[10,3,11,3],[10,4,10,5],[10,7,11,7]]}
[{"$f":"I.!A1","v":""},"Област:",{"$f":"I.!C1","v":0}]
[{"$f":"I.!A2","v":""},"Лечебно заведение:",{"$f":"I.!C2","v":0}]
[null,"Година:",{"$f":"I.!C3","v":2023}]
[]
[]
[]
[]
[null,"Раздел IX. Дейност на пневмофтизиатричните структури"]
[22,"2. Масови проф. прегледи на населението за туберкулоза и хрон. неспец. белодр. заб."]
[null,null,null,null,null,null,null,"ХОРИЗОНТАЛЕН КОНТРОЛ:"]
[null,null,"Ши-фър","Всичко","В това число:",null,null,"к.1= к.2+к.3 "]
[null,null,null,null," Възрастни (18 и повече год.)"," Деца до 17 г."]
[null,"а","б",1,2,3]
[null,"Изследвани лица","01",null,null,null,null,{"$f":"IF(D14=E14+F14,\"\",\"грешка\")","v":""}]
[null,"от тях открити болни, неизвестни на лечебното заведение (ш.03+04+05) ","02",null,null,null,null,{"$f":"IF(D15=E15+F15,\"\",\"грешка\")","v":""}]
{"$rows_left_out":8}
{"sheet":"X.1.","index":22,"n_rows":65,"n_cols":4,"rows_kept":65,"cut":false,"hidden":false,"merged":[]}
[{"$f":"I.!A1","v":""},"Област:",{"$f":"I.!C1","v":0}]
[{"$f":"I.!A2","v":""},"Лечебно заведение:",{"$f":"I.!C2","v":0}]
[null,"Година:",{"$f":"I.!C3","v":2023}]
[]
[]
[]
[]
[null,"Раздел X. Медицинска апаратура и изследвания"]
[23,"1. Медицинска апаратура"]
[]
[null,null,"Ши-фър","Брой"]
[null,"а","б",1]
[null,"Апарат за роботизирана хирургия","01"]
[null,"SPECT/CT","02"]
[null,"ПЕТ скенер","03"]
{"$rows_left_out":51}
{"sheet":"X.2.","index":23,"n_rows":37,"n_cols":4,"rows_kept":37,"cut":false,"hidden":false,"merged":[]}
[{"$f":"I.!A1","v":""},"Област:",{"$f":"I.!C1","v":0}]
[{"$f":"I.!A2","v":""},"Лечебно заведение:",{"$f":"I.!C2","v":0}]
[null,"Година:",{"$f":"I.!C3","v":2023}]
[]
[]
[]
[]
[null,"Раздел X. Медицинска апаратура и изследвания"]
[24,"2. Извършени изследвания"]
[]
[null,null,"Ши-фър","Брой изследвания"]
[null,"а","б",1]
[null,"ПЕТ скенер","01"]
[null,"Ядрено-магнитен резонанс","02"]
[null,"Ехографии","03"]
{"$rows_left_out":23}
{"sheet":"XI.","index":24,"n_rows":23,"n_cols":4,"rows_kept":23,"cut":false,"hidden":false,"merged":[]}
[{"$f":"I.!A1","v":""},"Област:",{"$f":"I.!C1","v":0}]
[{"$f":"I.!A2","v":""},"Лечебно заведение:",{"$f":"I.!C2","v":0}]
[null,"Година:",{"$f":"I.!C3","v":2023}]
[]
[]
[]
[]
[null,"Раздел XІ."]
[25,"Физиотерапевтична дейност"]
[]
[null,null,"Ши-фър","Брой процедури"]
[null,"а","б",1]
[null,"Кинезитерапия","01"]
[null,"Масажи","02"]
[null,"Лазертерапия","03"]
{"$rows_left_out":9}
{"sheet":"XII.","index":25,"n_rows":35,"n_cols":7,"rows_kept":35,"cut":false,"hidden":false,"merged":[[32,2,32,4],[32,6,32,8],[33,6,33,8],[34,6,34,8],[33,2,33,4],[34,2,34,4]]}
[{"$f":"I.!A1","v":""},"Област:",{"$f":"I.!C1","v":0}]
[{"$f":"I.!A2","v":""},"Лечебно заведение:",{"$f":"I.!C2","v":0}]
[null,"Година:",{"$f":"I.!C3","v":2023}]
[]
[]
[]
[]
[null,"Раздел XІІ."]
[26,"Tранспорт на лечебното заведение"]
[null,null,null,null,null,null,"ХОРИЗОНТАЛЕН КОНТРОЛ:"]
[null,null,"Ши-фър","Всичко","в т.ч. в движение",null,"к.1і к.2 "]
[null,"а","б",1,2]
[null,"Санитарни моторни превозни средства в края на годината (ш.02 до 07)","01",null,null,null,{"$f":"IF(D13<E13,\"грешка\",\"\")","v":""}]
[null,"линейки","02",null,null,null,""]
[null,"леки коли","03",null,null,null,""]
{"$rows_left_out":21}
{"sheet":"obl","index":26,"n_rows":28,"n_cols":2,"rows_kept":28,"cut":false,"hidden":true,"merged":[]}
["01 Благоевград          ","01"]
["02 Бургас               ","02"]
["03 Варна                ","03"]
["04 Велико Търново       ","04"]
["05 Видин                ","05"]
["06 Враца                ","06"]
["07 Габрово              ","07"]
["08 Добрич               ","08"]
["09 Кърджали             ","09"]
["10 Кюстендил            ","10"]
["11 Ловеч                ","11"]
["12 Монтана              ","12"]
["13 Пазарджик            ","13"]
["14 Перник               ","14"]
["15 Плевен               ","15"]
{"$rows_left_out":14}
{"sheet":"zav","index":27,"n_rows":448,"n_cols":3,"rows_kept":448,"cut":false,"hidden":true,"merged":[]}
["01","01 Индивидуални практики за ПМП - Благоевград","111"]
["01","01 Индивидуални практики за ПДП - Благоевград","122"]
["01","01 Групови практики за ПМП - Благоевград","131"]
["01","01 Групови практики за ПДП - Благоевград","142"]
["01","01 Индивидуални практики за СМП - Благоевград","211"]
["01","01 Индивидуални практики за СДП - Благоевград","222"]
["01","01 Групови практики за СМП - Благоевград","231"]
["01","01 Групови практики за СДП - Благоевград","242"]
["01","01 Медицински центрове - Благоевград","251"]
["01","01 Дентални центрове - Благоевград","262"]
["01","01 Медико-дентални центрове - Благоевград","270"]
["01","01 Диагностично-консултативни центрове - Благоевград","281"]
["01","01 Самостоятелни медико-диагностични лаборатории - Благоевград","293"]
["01","01 Самостоятелни медико-технически лаборатории - Благоевград","294"]
["01","01 Индивидуални практики за здравни грижи - Благоевград","195"]
{"$rows_left_out":433}